[syslinux] Re: Problem compiling syslinux-3.01

H. Peter Anvin hpa at zytor.com
Tue Jan 4 13:16:45 PST 2005

Terry Chan wrote:
> In my last post I pasted the last few line of the compile log for
> syslinux-3.02pre2.  Here are the correct lines from my failed attempt to
> compile syslinux-3.01.  Still the same error.
> make[1]: Leaving directory `/usr/src/syslinux-3.01/unix'
> make[1]: Entering directory `/usr/src/syslinux-3.01/extlinux'
> gcc -Wp,-MT,extlinux.o,-MMD,.extlinux.o.d -W -Wall -Wno-sign-compare -D_FILE_OFFSET_BITS=64 -g -Os -I. -I.. -I../libfat -c -o extlinux.o extlinux.c
> extlinux.c: In function `get_size':
> extlinux.c:285: error: `u64' undeclared (first use in this function)
> extlinux.c:285: error: (Each undeclared identifier is reported only once
> extlinux.c:285: error: for each function it appears in.)
> make[1]: *** [extlinux.o] Error 1
> make[1]: Leaving directory `/usr/src/syslinux-3.01/extlinux'
> make: *** [installer] Error 2
> Still on the same linux box that compiled syslinux-2.13 successfully.
> gcc-3.3.3, glibc-2.3.3, nasm-0.98.38, mtools-3.9.9, kernel 2.4.28
> AMD64 3000+, running in 32bit mode.

Could you please try 3.02-pre2?


More information about the Syslinux mailing list